{"text_format":"1","workbook":"xlsx","n_sheets":6,"sheets":["Reservation","Incentive Payment","Inspection Disclaimers","Test Form","Diagnostic Test Form","Lists"],"not_rendered":{"charts":0,"images":4,"macros":1,"external_links":0,"defined_names":355,"comments":3,"pivot_tables":0},"unopened":[],"bounds":{"document_bytes":16777216,"sheet_cells":100000,"rows_first":2000,"rows_last":500,"rows_between":2000,"halvings":0,"cell_chars":16384,"cell_head_chars":4096},"cells_cut":0,"cells_raw":0,"read":"whole","date_system":"1900"}

{"sheet":"Reservation","index":0,"n_rows":61,"n_cols":35,"rows_kept":61,"cut":false,"hidden":false,"merged":[[22,33,22,37],[50,15,52,19],[51,13,51,14],[50,7,52,12],[47,1,49,6],[47,7,49,8],[47,9,49,10],[47,14,49,16],[47,22,49,23],[47,24,49,26],[38,1,40,6],[29,1,31,5],[29,22,31,23],[32,22,34,23],[35,22,37,23],[38,22,40,23],[41,22,43,23],[35,31,37,32],[32,24,34,26],[29,34,31,37],[26,34,28,37],[23,34,25,37],[21,1,21,37],[14,1,14,2],[18,1,18,37],[7,1,7,37],[8,1,8,4],[8,34,8,37],[8,31,8,33],[8,23,8,30],[8,20,8,22],[8,5,8,19],[12,1,12,37],[13,20,13,37],[13,1,13,19],[10,10,10,13],[9,32,11,34],[10,29,10,30],[10,35,10,36],[9,25,11,28],[16,3,16,14],[19,24,19,37],[14,16,14,19],[14,11,14,15],[14,3,14,10],[14,35,14,37],[14,22,14,29],[47,27,49,27],[47,28,47,29],[47,30,49,30],[48,11,48,13],[48,17,48,20],[48,28,48,29],[49,28,49,29],[15,36,15,37],[15,20,15,23],[15,24,15,31],[16,20,16,21],[14,20,14,21],[15,32,15,35],[14,30,14,34],[16,36,16,37],[16,34,16,35],[32,31,34,32],[23,24,25,26],[35,24,37,26],[38,24,40,26],[41,24,43,26],[23,22,25,23],[26,22,28,23],[15,1,15,4],[15,18,15,19],[15,14,15,17],[15,5,15,13],[30,14,30,15],[27,11,27,12],[19,1,19,4],[19,5,19,19],[35,1,37,6],[33,19,33,20],[32,17,34,18],[35,17,37,18],[36,19,36,20],[23,1,25,4],[22,1,22,21],[23,13,25,16],[30,16,30,17],[32,1,34,5],[19,20,19,23],[16,1,16,2],[16,18,16,19],[16,15,16,17],[16,22,16,33],[29,31,31,32],[56,3,59,35],[60,10,60,30],[60,33,60,36],[41,31,43,32],[22,27,22,32],[22,22,22,26],[23,27,25,30],[26,27,28,30],[29,27,31,30],[32,27,34,30],[35,27,37,30],[38,27,40,30],[23,31,25,32],[41,27,43,30],[50,1,52,6],[50,22,52,23],[50,24,52,26],[44,1,46,11],[44,12,46,13],[44,14,46,16],[45,17,45,20],[26,24,28,26],[29,24,31,26],[51,28,51,29],[29,18,31,19],[30,8,30,10],[30,11,30,12],[50,31,52,32],[50,33,52,33],[32,34,34,37],[24,17,24,18],[53,20,54,32],[53,3,54,19],[38,17,40,18],[39,19,39,20],[41,17,43,18],[42,19,42,20],[41,1,43,9],[26,1,28,5],[27,8,27,10],[27,16,27,17],[27,14,27,15],[26,6,28,7],[26,18,28,19],[26,31,28,32],[38,31,40,32],[5,1,5,13],[53,33,54,33],[41,33,43,33],[38,33,40,33],[35,33,37,33],[32,33,34,33],[29,33,31,33],[26,33,28,33],[23,33,25,33],[44,22,46,23],[44,24,46,26],[44,31,46,32],[45,28,45,29],[47,31,49,32],[44,27,46,27],[44,28,44,29],[44,30,46,30],[46,28,46,29],[50,27,52,27],[50,30,52,30],[50,28,50,29],[52,28,52,29],[53,1,54,1],[29,6,31,7],[53,34,54,37],[41,34,43,37],[38,34,40,37],[35,34,37,37],[44,33,46,33],[44,34,46,37],[47,33,49,33],[47,34,49,37],[50,34,52,37]]}
[null,"HOME EFFICIENCY INITIATIVE"]
[null,"Program Year 2024 Project Reservation Request"]
[]
[null,"Form Use: This form is to be used to submit project reservation requests prior to beginning work"]
[null,"Please complete all required information as specified below and email, with any required supporting documentation, to:"]
[null,"ResidentialEEApplications@ameren.com"]
[]
[null," SECTION 1: PROJECT INFORMATION"]
[null," Street Address:",null,null,null,null,null,null,null,null,null,null,null,null,null,null,null,null,null,null,"City:",null,null,null,null,null,null,null,null,null,null," Zip Code:"]
[null,null,null,null,null,null,null,null,null,null,null,null,null,null,null,null,null,null,null,null,null,null,null,null,null,"Conditioned Floor Area (SF):",null,null,null,null,null,null,"Number of \nStories:"]
[null," Ameren Illinois Account Number  ",null,null,null,null,null,null,null,null,null,null,null,null,null,null,"Gas Account",null,null,null,null,"Electric Account"]
[]
[null," Existing Primary Conditioning Equipment (If two or more units exist, please provide and separate model numbers, age, etc. with an *)"]
[null,"Heating Equipment",null,null,null,null,null,null,null,null,null,null,null,null,null,null,null,null,null,null,"Cooling Equipment"]
[null,"System\nType:",null,null,null,null,null,null,null,null,null," Heating Capacity\n Input (Btuh or KwH):",null,null,null,null,null,null,null,null,"System\nType:",null,null,null,null,null,null,null,null,null,"Cooling Capacity\n(Btuh):"]
{"$rows_left_out":47}
{"sheet":"Incentive Payment","index":1,"n_rows":70,"n_cols":34,"rows_kept":70,"cut":false,"hidden":false,"merged":[[20,33,20,37],[32,33,32,37],[28,24,28,29],[42,32,44,32],[42,33,44,37],[42,30,44,31],[45,1,46,17],[9,1,9,37],[42,24,42,29],[44,24,44,29],[42,1,44,5],[42,6,44,10],[42,12,44,16],[42,18,42,23],[44,18,44,23],[28,30,28,31],[25,1,27,3],[25,6,27,8],[25,11,27,13],[25,18,27,19],[26,4,26,5],[26,9,26,10],[26,14,26,17],[30,20,30,21],[41,30,41,31],[41,33,41,37],[21,18,23,19],[22,4,22,5],[22,9,22,10],[22,14,22,17],[24,33,24,37],[26,20,26,21],[28,1,28,17],[24,21,24,23],[32,1,32,17],[32,24,32,29],[32,30,32,31],[40,21,40,23],[40,24,40,29],[40,30,40,31],[40,33,40,37],[36,33,36,37],[70,1,70,37],[61,1,61,37],[62,1,62,37],[63,1,63,37],[64,1,64,37],[65,1,65,37],[66,1,66,37],[67,1,67,37],[68,1,68,37],[69,1,69,37],[58,1,58,37],[59,1,59,37],[60,1,60,37],[52,2,52,37],[54,2,54,37],[20,1,20,17],[20,24,20,29],[20,30,20,31],[16,24,16,29],[17,1,19,3],[17,6,19,8],[17,11,19,13],[17,18,19,19],[18,4,18,5],[18,9,18,10],[18,14,18,17],[28,33,28,37],[22,20,22,21],[24,1,24,17],[24,24,24,29],[24,30,24,31],[21,1,23,3],[21,6,23,8],[21,11,23,13],[7,1,7,37],[8,1,8,5],[16,33,16,37],[13,2,15,5],[13,10,15,13],[14,6,14,8],[14,14,14,16],[16,1,16,17],[10,1,10,37],[11,1,11,17],[11,18,11,23],[11,24,11,29],[11,32,11,37],[12,1,12,17],[12,24,12,29],[12,30,12,31],[12,33,12,37],[16,30,16,31],[8,6,8,11],[8,12,8,15],[8,16,8,25],[8,26,8,29],[8,30,8,37],[5,1,5,11],[56,1,56,8],[45,18,46,31],[48,1,48,37],[45,33,46,37],[45,32,46,32],[38,9,38,10],[38,14,38,17],[36,1,36,17],[36,24,36,29],[36,30,36,31],[37,1,39,3],[37,6,39,8],[37,11,39,13],[37,18,39,19],[38,4,38,5],[34,14,34,17],[29,1,31,3],[29,6,31,8],[29,11,31,13],[29,18,31,19],[30,4,30,5],[30,9,30,10],[30,14,30,17],[20,21,20,23],[16,21,16,23],[12,21,12,23],[36,18,36,20],[32,18,32,20],[28,18,28,20],[24,18,24,20],[20,18,20,20],[16,18,16,20],[12,18,12,20],[18,20,18,21],[36,21,36,23],[32,21,32,23],[28,21,28,23],[43,18,43,20],[43,21,43,23],[43,24,43,29],[33,1,35,3],[33,6,35,8],[33,11,35,13],[33,18,35,19],[34,4,34,5],[34,9,34,10],[40,1,40,12],[40,13,40,14],[40,15,40,17],[40,18,40,20],[41,1,41,12],[41,13,41,14],[41,15,41,17],[41,18,41,20],[41,21,41,23],[41,24,41,29],[55,33,55,37],[55,31,55,32],[55,1,55,5],[55,6,55,15],[55,16,55,20],[55,21,55,30],[56,31,56,32],[56,33,56,37],[56,9,56,30]]}
[null,"HOME EFFICIENCY INITIATIVE"]
[null,"Program Year 2024 Project Incentive Payment Request"]
[]
[null,"Form Use: This form is to be used to submit project incentive payment requests once reserved work has been completed"]
[null,"Please complete all required information as specified below and email, with any required supporting documentation, to:"]
[null,"ResidentialEEApplications@ameren.com"]
[]
[null," SECTION 1: PROJECT and PROGRAM ALLY INFORMATION"]
[null,"Project Reservation \nNumber: ",null,null,null,null,null,null,null,null,null,null,"Program Ally Company Name:",null,null,null,{"$f":"IF(ISBLANK(Reservation!F20),\"\",Reservation!F20)","v":""},null,null,null,null,null,null,null,null,null,"Program Ally\nContact Email:",null,null,null,{"$f":"IF(ISBLANK(Reservation!Y20),\"\",Reservation!Y20)","v":""}]
[]
[null," SECTION 2: ENERGY EFFICIENCY MEASURE INFORMATION"]
[null,"MEASURE",null,null,null,null,null,null,null,null,null,null,null,null,null,null,null,null,"INCENTIVE RATE",null,null,null,null,null,"FINAL QUANTITY",null,null,null,null,null,null,null,"SUBTOTAL"]
[null," Air Sealing",null,null,null,null,null,null,null,null,null,null,null,null,null,null,null,null,{"$f":"Lists!E3","v":0.7},null,null,"per CFM",null,null,{"$f":"IF(ISBLANK(Reservation!R25),\"\",G15-O15)","v":""},null,null,null,null,null,"CFM",null,"$",{"$f":"IF(ISBLANK(Reservation!R25),\"\",IF(ISBLANK(O15),\"\",Y13*S13))","v":""}]
[null,null,"Initial Blower\nDoor Reading:",null,null,null,null,null,null,null,"Final Blower\nDoor Reading:"]
[null,null,null,null,null,null,{"$f":"IF(ISBLANK(Reservation!R25),\"\",Reservation!R25)","v":""}]
{"$rows_left_out":56}
{"sheet":"Inspection Disclaimers","index":2,"n_rows":97,"n_cols":22,"rows_kept":97,"cut":false,"hidden":false,"merged":[[2,1,2,23],[1,1,1,23],[7,21,7,23],[3,1,5,23],[6,1,6,23],[7,1,7,3],[7,4,7,12],[7,14,7,17],[8,1,8,3],[8,4,8,15],[8,16,8,20],[8,21,8,23],[9,1,9,23],[14,2,14,6],[14,7,14,8],[14,9,14,23],[15,2,15,6],[15,7,15,8],[15,9,15,23],[10,1,10,23],[11,1,11,14],[11,16,11,18],[11,20,11,23],[12,1,12,23],[13,2,13,6],[13,7,13,8],[13,9,13,23],[18,1,18,23],[21,15,21,23],[22,2,22,23],[23,2,23,23],[16,3,16,6],[16,7,16,8],[16,9,16,23],[17,1,17,14],[17,16,17,18],[17,20,17,23],[20,15,20,23],[19,15,19,23],[21,2,21,13],[20,2,20,13],[19,2,19,13],[24,2,24,5],[24,6,24,7],[24,8,24,14],[24,15,24,16],[24,17,24,23],[25,1,26,1],[25,2,26,5],[25,6,25,7],[25,8,25,14],[25,16,25,17],[27,2,27,23],[28,2,28,23],[29,2,29,23],[30,1,31,23],[33,1,33,23],[34,1,34,14],[34,16,34,18],[34,20,34,23],[25,18,25,21],[25,22,25,23],[26,6,26,7],[26,8,26,14],[26,16,26,17],[26,18,26,21],[26,22,26,23],[32,1,32,23],[44,1,44,14],[44,16,44,18],[44,20,44,23],[45,2,45,23],[46,1,46,2],[46,3,46,23],[35,2,35,23],[36,1,36,14],[36,16,36,18],[36,20,36,23],[38,1,42,23],[43,1,43,23],[37,20,37,23],[51,1,51,23],[52,1,52,14],[52,16,52,18],[52,20,52,23],[53,2,53,23],[54,1,58,23],[47,2,47,23],[48,1,48,2],[48,3,48,23],[49,2,49,23],[50,1,50,2],[50,3,50,23],[62,1,63,23],[64,2,64,23],[65,2,65,23],[66,2,66,23],[67,2,67,23],[71,1,71,23],[59,2,59,14],[59,16,59,23],[60,1,60,23],[61,1,61,14],[61,16,61,18],[61,20,61,23],[70,1,70,23],[80,1,80,5],[80,6,80,18],[80,19,80,20],[80,21,80,23],[82,1,82,23],[84,1,84,23],[72,1,72,14],[72,16,72,18],[72,20,72,23],[73,1,76,23],[78,2,78,23],[79,19,79,20],[79,21,79,23],[81,1,81,23],[77,1,77,23],[79,1,79,3],[79,13,79,18],[79,10,79,12],[79,4,79,9],[88,4,88,5],[88,6,88,8],[88,9,88,10],[88,11,88,13],[88,14,88,16],[88,17,88,19],[85,1,85,23],[86,1,86,5],[86,6,86,15],[86,16,86,17],[86,18,86,23],[87,1,87,23],[88,1,88,3],[88,20,88,23],[90,1,90,5],[90,6,90,19],[90,21,90,23],[91,1,91,23],[92,1,92,6],[92,7,92,15],[92,16,92,17],[92,18,92,23],[89,1,89,2],[89,3,89,11],[89,12,89,13],[89,14,89,16],[89,18,89,20],[89,21,89,23],[97,1,97,23],[96,1,96,5],[96,6,96,19],[96,21,96,23],[93,1,93,6],[93,7,93,23],[94,1,94,23],[95,1,95,2],[95,3,95,11],[95,12,95,13],[95,14,95,16],[95,18,95,20],[95,21,95,23]]}
[]
[null,"AMEREN ILLINOIS ENERGY EFFICIENCY PROGRAM"]
[null,"Energy Audit Inspection Disclaimers"]
[null,"Please complete the application, provide a copy to the customer, attach required documentation and send it to the following email address: ResidentialEEApplications@ameren.com. All projects will receive a reservation number via email. The reservation number is required \nprior to project start date. All program paperwork must be submitted within 30 days of the project completion or by December 31st, whichever comes first."]
[]
[]
[null,"    SECTION 1: PROJECT INFORMATION"]
[null,"Address:",null,null,{"$f":"IF(Reservation!F9=\"\",\"\",Reservation!F9)","v":""},null,null,null,null,null,null,null,null,"City:",{"$f":"IF(Reservation!X9=\"\",\"\",Reservation!X9)","v":""},null,null,null,"IL",null,"Zip Code:",{"$f":"IF(Reservation!AI9=\"\",\"\",Reservation!AI9)","v":""}]
[null,"Project Number:",null,null,null,null,null,null,null,null,null,null,null,null,null,null,"Assessment Date:"]
[]
[null,"     SECTION 2.1: INSPECTION INFORMATION (Check all applicable areas)"]
[null,"     ASBESTOS",null,null,null,null,null,null,null,null,null,null,null,null,null,null,"Applicable",null,null,null,"Not Applicable"]
[null,"The following suspected Asbestos Containing Materials (ACMs) were identified in your home. It is important to understand that it is not possible to determine if a material has asbestos without professional testing and for this reason all possible ACMs must be treated as if it contains asbestos. This may disqualify your home from participation in the Ameren Illinois Energy Efficiency Program; however, proper precautions must be taken to ensure the suspect ACMs will not be disturbed. As a result, any measure that would result in work taking place in an area with suspect ACMs or that could disturb the asbestos is not allowed. For more information regarding asbestos, please visit www.epa.gov/asbestos and refer to “Suspect ACM White Paper”."]
[null,null,"Vermiculite",null,null,null,null,"Location:"]
[null,null,"Suspect Asbestos Siding",null,null,null,null,"Location:"]
{"$rows_left_out":83}
{"sheet":"Test Form","index":3,"n_rows":105,"n_cols":37,"rows_kept":105,"cut":false,"hidden":false,"merged":[[101,1,103,5],[101,6,101,20],[102,6,102,20],[103,6,103,20],[104,1,104,5],[104,6,104,20],[97,1,97,5],[97,6,97,20],[98,1,99,5],[98,6,98,20],[99,6,99,20],[100,1,100,5],[100,6,100,20],[93,1,93,5],[93,6,93,20],[94,1,96,5],[94,6,94,20],[95,6,95,20],[96,6,96,20],[90,1,90,19],[90,20,90,23],[90,24,90,27],[90,28,90,37],[91,1,91,20],[92,1,92,5],[92,6,92,20],[87,1,87,9],[87,10,87,17],[87,25,87,37],[88,1,88,9],[88,10,88,17],[88,25,89,37],[89,1,89,9],[85,1,85,9],[85,10,85,17],[85,25,85,26],[86,1,86,9],[86,10,86,17],[86,25,86,26],[83,1,83,9],[83,10,83,17],[83,25,83,26],[84,1,84,9],[84,10,84,17],[84,25,84,26],[81,1,81,9],[81,10,81,17],[81,25,81,26],[81,33,81,35],[81,36,81,37],[82,1,82,9],[82,10,82,17],[82,25,82,26],[82,33,82,35],[82,36,82,37],[79,1,79,9],[79,10,79,17],[79,25,79,26],[79,33,79,35],[79,36,79,37],[80,1,80,9],[80,10,80,17],[80,25,80,26],[80,33,80,35],[80,36,80,37],[77,25,77,26],[78,1,78,9],[78,10,78,17],[78,25,78,26],[78,33,78,35],[78,36,78,37],[75,1,75,9],[75,25,75,32],[75,33,75,37],[76,1,76,9],[76,10,76,17],[76,25,76,26],[76,33,77,35],[76,36,77,37],[77,1,77,9],[77,10,77,17],[72,1,72,37],[73,1,73,37],[74,1,74,9],[74,10,74,24],[74,25,74,32],[74,33,74,37],[66,1,66,37],[67,1,67,37],[68,1,68,37],[69,1,69,37],[70,1,70,37],[71,1,71,37],[62,1,62,22],[62,23,62,24],[62,26,62,29],[62,30,62,31],[62,32,62,35],[65,1,65,37],[58,1,58,22],[58,23,58,24],[58,26,58,36],[60,1,60,22],[60,23,60,24],[60,26,60,29],[60,30,60,31],[60,32,60,35],[64,1,64,37],[53,26,56,36],[54,1,54,22],[54,23,54,24],[56,1,56,22],[56,23,56,24],[57,26,57,36],[50,17,50,21],[50,22,50,24],[50,25,50,34],[50,35,50,36],[52,1,52,9],[52,10,52,11],[52,12,52,16],[52,17,52,18],[52,26,52,36],[47,27,47,34],[47,35,47,36],[48,2,48,9],[48,10,48,12],[48,13,48,15],[48,16,48,18],[48,19,48,21],[48,22,48,24],[48,27,48,34],[48,35,48,36],[47,2,47,9],[47,10,47,12],[47,13,47,15],[47,16,47,18],[47,19,47,21],[47,22,47,24],[45,26,45,36],[46,2,46,9],[46,10,46,12],[46,13,46,15],[46,16,46,18],[46,19,46,21],[46,22,46,24],[46,27,46,34],[46,35,46,36],[45,2,45,9],[45,10,45,12],[45,13,45,15],[45,16,45,18],[45,19,45,21],[45,22,45,24],[43,26,43,36],[44,2,44,9],[44,10,44,12],[44,13,44,15],[44,16,44,18],[44,19,44,21],[44,22,44,24],[44,26,44,36],[43,2,43,9],[43,10,43,12],[43,13,43,15],[43,16,43,18],[43,19,43,21],[43,22,43,24],[42,2,42,9],[42,10,42,12],[42,13,42,15],[42,16,42,18],[42,19,42,21],[42,22,42,24],[40,1,40,37],[41,1,41,9],[41,10,41,12],[41,13,41,15],[41,16,41,18],[41,19,41,21],[41,22,41,24],[41,26,41,34],[41,35,41,36],[31,35,31,36],[33,1,33,19],[33,20,33,37],[34,1,34,19],[34,20,34,37],[35,1,39,19],[35,20,35,37],[36,20,39,37],[27,35,27,36],[29,1,31,15],[29,20,29,25],[29,26,29,27],[29,28,29,34],[29,35,29,36],[31,17,31,18],[31,20,31,27],[31,28,31,31],[31,32,31,34],[25,1,25,6],[25,7,25,8],[25,9,25,16],[25,17,25,18],[25,20,25,37],[27,1,27,15],[27,17,27,18],[27,20,27,25],[27,26,27,27],[27,28,27,34],[21,35,21,36],[23,1,23,15],[23,17,23,18],[23,20,23,24],[23,25,23,26],[23,27,23,34],[23,35,23,36],[18,1,18,19],[18,20,18,37],[19,1,19,15],[19,17,19,18],[19,20,19,37],[21,1,21,6],[21,7,21,8],[21,9,21,16],[21,17,21,18],[21,20,21,34],[14,1,14,37],[15,1,15,27],[15,28,15,32],[15,33,15,36],[17,1,17,37],[12,1,12,37],[13,1,13,37],[9,1,9,37],[10,1,10,37],[11,1,11,10],[11,11,11,13],[11,14,11,15],[11,16,11,17],[11,18,11,23],[11,24,11,25],[11,26,11,34],[11,35,11,36],[6,1,6,37],[7,1,7,37],[8,1,8,7],[8,8,8,16],[8,17,8,21],[8,22,8,36],[0,1,0,37],[1,1,1,37],[2,1,2,37],[3,1,3,37],[4,1,4,37],[5,1,5,4],[5,5,5,11],[5,12,5,15],[5,17,5,36]]}
[null," AMEREN ILLINOIS ENERGY EFFICIENCY PROGRAM"]
[null," Residential Single-Family Project Test Form"]
[]
[null," SECTION 1: PROJECT INFORMATION"]
[]
[null,"Project Number",null,null,null,{"$f":"IF('Incentive Payment'!G9=\"\",\"\",'Incentive Payment'!G9)","v":""},null,null,null,null,null,null,"Street Address",null,null,null,null,{"$f":"IF(Reservation!F9=\"\",\"\",Reservation!F9)","v":""}]
[]
[]
[null,"BPI-Certified Tester Name",null,null,null,null,null,null,null,null,null,null,null,null,null,null,null,"Program Ally Name"]
[]
[]
[null,"Floor Area in Square Feet (including basements)",null,null,null,null,null,null,null,null,null,null,null,null,"Stories",null,{"$f":"IF(Reservation!AJ11=\"\",\"\",Reservation!AJ11)","v":""},null,"Number of Bedrooms ",null,null,null,null,null,null,null,"Combustion Safety Testing Required "]
[]
[]
[]
{"$rows_left_out":91}
{"sheet":"Diagnostic Test Form","index":4,"n_rows":141,"n_cols":19,"rows_kept":141,"cut":false,"hidden":true,"merged":[[135,1,135,18],[136,1,136,18],[137,1,137,18],[138,1,138,16],[138,17,138,18],[140,1,140,3],[131,1,131,18],[132,1,134,11],[132,12,132,18],[133,12,133,16],[133,17,133,18],[134,12,134,16],[134,17,134,18],[126,1,126,17],[127,1,127,17],[128,1,128,17],[129,1,130,7],[129,8,129,17],[130,8,130,17],[124,1,124,12],[124,13,124,15],[124,16,124,17],[125,1,125,9],[125,10,125,14],[125,16,125,17],[123,1,123,7],[123,8,123,9],[123,10,123,11],[123,12,123,13],[123,14,123,15],[123,16,123,17],[122,1,122,7],[122,8,122,9],[122,10,122,11],[122,12,122,13],[122,14,122,15],[122,16,122,17],[121,1,121,7],[121,8,121,9],[121,10,121,11],[121,12,121,13],[121,14,121,15],[121,16,121,17],[120,1,120,7],[120,8,120,9],[120,10,120,11],[120,12,120,13],[120,14,120,15],[120,16,120,17],[119,1,119,7],[119,8,119,9],[119,10,119,11],[119,12,119,13],[119,14,119,15],[119,16,119,17],[118,1,118,7],[118,8,118,9],[118,10,118,11],[118,12,118,13],[118,14,118,15],[118,16,118,17],[117,1,117,7],[117,8,117,9],[117,10,117,11],[117,12,117,13],[117,14,117,15],[117,16,117,17],[115,1,115,18],[116,1,116,7],[116,8,116,9],[116,10,116,11],[116,12,116,13],[116,14,116,15],[116,16,116,17],[110,1,110,17],[111,1,111,17],[112,1,112,17],[113,1,114,7],[113,8,113,17],[114,8,114,17],[108,1,108,12],[108,13,108,15],[108,16,108,17],[109,1,109,9],[109,10,109,14],[109,16,109,17],[107,1,107,7],[107,8,107,9],[107,10,107,11],[107,12,107,13],[107,14,107,15],[107,16,107,17],[106,1,106,7],[106,8,106,9],[106,10,106,11],[106,12,106,13],[106,14,106,15],[106,16,106,17],[105,1,105,7],[105,8,105,9],[105,10,105,11],[105,12,105,13],[105,14,105,15],[105,16,105,17],[104,1,104,7],[104,8,104,9],[104,10,104,11],[104,12,104,13],[104,14,104,15],[104,16,104,17],[103,1,103,7],[103,8,103,9],[103,10,103,11],[103,12,103,13],[103,14,103,15],[103,16,103,17],[102,1,102,7],[102,8,102,9],[102,10,102,11],[102,12,102,13],[102,14,102,15],[102,16,102,17],[101,1,101,7],[101,8,101,9],[101,10,101,11],[101,12,101,13],[101,14,101,15],[101,16,101,17],[99,1,99,18],[100,1,100,7],[100,8,100,9],[100,10,100,11],[100,12,100,13],[100,14,100,15],[100,16,100,17],[98,1,98,7],[98,8,98,9],[98,10,98,11],[98,12,98,13],[98,14,98,16],[98,17,98,18],[95,1,95,5],[95,6,95,7],[95,10,95,14],[95,15,95,16],[96,1,96,18],[97,1,97,18],[92,1,92,18],[93,1,93,2],[93,3,93,6],[93,7,93,9],[93,10,93,18],[94,1,94,18],[87,1,87,18],[88,1,88,18],[89,1,89,18],[90,1,90,16],[90,17,90,18],[91,1,91,18],[76,13,76,15],[83,1,83,7],[83,8,83,11],[83,13,83,15],[84,1,86,11],[84,13,84,15],[85,13,85,15],[86,13,86,15],[81,1,81,7],[81,8,81,11],[81,13,81,15],[82,1,82,7],[82,8,82,11],[82,13,82,15],[76,16,76,17],[77,1,77,7],[77,8,77,11],[77,13,77,15],[77,16,86,18],[78,1,78,7],[78,8,78,11],[74,1,74,7],[74,8,74,11],[74,13,74,15],[74,16,74,17],[75,1,75,7],[75,8,75,11],[75,13,75,15],[75,16,75,17],[78,13,78,15],[79,1,79,7],[79,8,79,11],[79,13,79,15],[80,1,80,7],[80,8,80,11],[80,13,80,15],[76,1,76,7],[76,8,76,11],[72,1,72,7],[72,8,72,11],[72,13,72,15],[72,16,72,17],[73,1,73,7],[73,8,73,11],[73,13,73,15],[73,16,73,17],[69,12,69,15],[70,1,70,7],[70,8,70,11],[70,13,70,15],[70,16,71,17],[70,18,71,18],[71,1,71,7],[71,8,71,11],[71,13,71,15],[63,1,63,18],[64,1,64,18],[65,1,65,18],[66,1,66,18],[67,1,67,18],[68,1,68,11],[68,12,68,15],[68,16,69,18],[69,1,69,7],[69,8,69,11],[56,8,56,10],[56,14,56,16],[57,1,57,18],[58,1,58,18],[59,1,61,18],[62,1,62,18],[52,1,52,2],[53,1,53,2],[54,1,54,2],[55,1,55,2],[56,1,56,2],[56,3,56,6],[50,1,51,1],[50,2,51,3],[50,4,51,4],[50,5,50,6],[50,9,50,10],[50,15,50,16],[47,1,47,18],[48,1,48,18],[49,1,49,4],[49,5,49,6],[49,7,49,12],[49,13,49,18],[43,1,43,16],[43,17,43,18],[44,1,44,18],[45,1,45,18],[46,3,46,6],[46,10,46,18],[37,1,37,10],[38,1,38,10],[39,1,39,10],[40,1,40,18],[41,1,41,18],[42,1,42,18],[32,1,32,18],[33,1,33,8],[33,9,33,10],[34,1,34,10],[35,1,35,10],[36,1,36,10],[27,1,27,10],[27,11,27,12],[27,13,27,14],[27,15,27,18],[28,1,28,18],[29,1,31,18],[23,12,24,12],[23,13,23,18],[24,13,24,18],[25,5,25,10],[25,13,25,18],[26,1,26,8],[26,9,26,18],[20,1,20,4],[20,5,20,10],[20,13,20,18],[21,1,25,4],[21,5,21,10],[21,13,21,18],[22,5,22,10],[22,13,22,18],[23,5,24,10],[23,11,24,11],[16,1,16,4],[16,5,16,10],[16,13,16,18],[17,13,17,18],[18,1,19,4],[18,5,18,10],[18,13,18,18],[19,5,19,10],[19,13,19,18],[12,1,12,4],[12,5,12,10],[12,13,12,18],[13,1,15,4],[13,5,13,10],[13,13,13,18],[14,5,14,10],[14,13,14,18],[15,5,15,10],[15,13,15,18],[9,1,9,18],[10,1,10,4],[10,5,10,10],[10,13,10,18],[11,1,11,4],[11,5,11,10],[11,13,11,18],[7,1,7,4],[7,5,7,9],[7,10,7,13],[7,14,7,18],[8,1,8,9],[8,11,8,18],[0,1,0,18],[1,1,1,18],[2,1,2,18],[3,1,3,18],[4,1,4,2],[4,3,4,8],[4,9,4,10],[4,11,4,18],[6,1,6,2],[6,3,6,7],[6,8,6,9],[6,10,6,13],[6,14,6,15],[6,16,6,18],[5,1,5,2],[5,3,5,8],[5,9,5,10],[5,11,5,13],[5,15,5,16],[5,17,5,18]]}
[null,"Energy Efficiency Program"]
[null,"Energy Audit Diagnostic Test Form"]
[null,"Please complete all required information and submit this form as an attachment to the Incentive Application"]
[null,"Section 1:  Project Identification"]
[null,"Name:",null,{"$f":"IF(ISBLANK(Reservation!#REF!),\"\",Reservation!#REF!)","v":{"$error":"#REF!"}},null,null,null,null,null,"Primary Phone:",null,{"$f":"IF(ISBLANK(Reservation!#REF!),\"\",Reservation!#REF!)","v":{"$error":"#REF!"}}]
[null,"Address:",null,{"$f":"IF(ISBLANK(Reservation!F9),\"\",Reservation!F9)","v":""},null,null,null,null,null,"City:",null,{"$f":"IF(ISBLANK(Reservation!X9),\"\",Reservation!X9)","v":""},null,null,"IL","Zip Code:",null,{"$f":"IF(ISBLANK(Reservation!AI9),\"\",Reservation!AI9)","v":""}]
[null,"Project ID           (if required):",null,null,null,null,null,null,"Pre-Test Date:",null,null,null,null,null,"Post-Test Date:"]
[null,"Program Ally Company Name:",null,null,null,{"$f":"IF(ISBLANK(Reservation!F20),\"\",Reservation!F20)","v":""},null,null,null,null,"BPI-Certified Tester Name:"]
[null,"Was combustion safety testing required for this home?  Y / N:",null,null,null,null,null,null,null,null,null,"    If not, sections 3, 4, and 5 of this form may be left blank"]
[null,"Section 2:  Fuel Distribution System Inspection (always required when fuel lines exist in the residence)"]
[null,"Reference",null,null,null,"Selected Inspection Item",null,null,null,null,null,"Pre-Test Y/N","Post-Test Y/N","Actions levels for house ambient CO                                             BPI-1200 7.3.3.3"]
[null,"Conditions for entry",null,null,null,"House ambient combustible fuel gas > 10% LEL",null,null,null,null,null,null,null,"If ambient CO is 70 PPM or greater"]
[null,"BPI-1200 7.3",null,null,null,"House ambient CO level (PPM)",null,null,null,null,null,null,null," - Terminate the inspection"]
[null,"Natural gas and LP gas piping system inspection and leak testing",null,null,null,"Gas leak testing completed",null,null,null,null,null,null,null," - Notify occupants to evacuate"]
[null,null,null,null,null,"Gas leak(s) found",null,null,null,null,null,null,null," - Notify emergency services from outside"]
{"$rows_left_out":127}
{"sheet":"Lists","index":5,"n_rows":31,"n_cols":17,"rows_kept":31,"cut":false,"hidden":true,"merged":[]}
[]
["Central Air Conditioner",null,null,"Measure","Incentive",null,null,null,null,"TEST FORM"]
["Air Source Heat Pump",null,null,"Air Sealing",0.7,null,"X",null,null,"Stories","Story Factor","Wsf"]
["Mini-Split Heat Pump",null,null,"Attic ",1.1000000000000001]
["Window Unit",null,null,"Wall",1.1000000000000001,null,0,null,null,1,1,0.44]
["None",null,null,"Kneewall",1.1000000000000001,null,1,null,null,1.5,1.18,0.47,"Yes",null,"Pass",null,"Y"]
[null,null,null,"Rim Joist",2,null,null,null,null,2,1.32,0.48,"No",null,"Fail"]
[null,null,null,"Crawl Space",3,null,"Manual",null,null,2.5,1.44,0.51]
[null,null,null,"Exhaust Fan",25,null,"Programmable",null,null,3,1.55,0.55000000000000004]
["Natural Gas Furnace",null,null,"Smart Thermostat",100,null,null,null,null,null,null,0.56000000000000005]
["Natural Gas Boiler",null,null,"Duct Sealing",200,null,"0%",null,null,null,null,0.56999999999999995]
["Air Source Heat Pump",null,null,null,null,null,"< 25%",null,null,null,null,0.57999999999999996]
["Electric Resistance",null,null,null,null,null,"< 50%",null,null,null,null,0.6]
["Propane Furnace",null,null,null,null,null,"> 50%"]
["Propane Boiler",null,null,null,null,null,"> 75%"]
{"$rows_left_out":16}